Target
Muscarinic acetylcholine receptor M1
Ligand
BDBM50284323
Substrate
Meas. Tech.
ChEMBL_139842 (CHEMBL745740)
Kd
2520±n/a nM
Citation
 Malaska, MJFauq, AHKozikowski, APAagaard, PJMcKinney, M Chemical modification of ring c of himbacine: Discovery of a pharmacophoric element for M2-selectivity Bioorg Med Chem Lett 5:61-66 (1995)    Article 
Target
Name:
Muscarinic acetylcholine receptor M1
Synonyms:
ACM1_HUMAN Cholinergic receptor, muscarinic 1 | Cholinergic, muscarinic M1
Type:
Protein
Mol. Mass.:
51442.54
Organism:
Homo sapiens (Human)
Description:
P11229
Residue:
460
  
Inhibitor
Name:
BDBM50284323
Synonyms:
2,2-Dimethyl-propionic acid (1R,3S,3aR,4R,4aS,8aR,9aS)-4-[(E)-2-((2R,6S)-1,6-dimethyl-piperidin-2-yl)-vinyl]-3-methyl-dodecahydro-naphtho[2,3-c]furan-1-yl ester | CHEMBL158589
Type:
Small organic molecule
Emp. Form.:
C27H45NO3
Mol. Mass.:
431.6511
SMILES:
C[C@@H]1O[C@H](OC(=O)C(C)(C)C)[C@H]2C[C@H]3CCCC[C@@H]3[C@@H](\C=C\[C@H]3CCC[C@H](C)N3C)[C@@H]12
: