Target
Platelet-activating factor receptor
Ligand
BDBM50284409
Substrate
Meas. Tech.
ChEMBL_162887 (CHEMBL768983)
IC50
394±n/a nM
Citation
 Chung, SKBan, SHKim, SHKim, BEWoo, SHSummers, JBConway, RG Synthesis and bioactivities of heterocyclic lipids as PAF antagonists. 1 Bioorg Med Chem Lett 5:1091-1096 (1995)    Article 
Target
Name:
Platelet-activating factor receptor
Synonyms:
PAF-R PTAFR_CAVPO Platelet-activating factor receptor
Type:
Protein
Mol. Mass.:
39005.63
Organism:
Cavia porcellus
Description:
Residue:
342
  
Inhibitor
Name:
BDBM50284409
Synonyms:
2-{[Acetyl-(2,2-dimethyl-3-octadecylcarbamoyloxy-propoxycarbonyl)-amino]-methyl}-1-ethyl-pyridinium; iodide | CHEMBL12012
Type:
Small organic molecule
Emp. Form.:
C35H62N3O5
Mol. Mass.:
604.8833
SMILES:
(=O)OCC(C)(C)COC(=O)N(Cc1cccc[n+]1CC)C(C)=O
: