Target
Platelet-activating factor receptor
Ligand
BDBM50284414
Substrate
Meas. Tech.
ChEMBL_162886 (CHEMBL768982)
IC50
101±n/a nM
Citation
 Chung, SKBan, SHKim, SHKim, BEWoo, SHSummers, JBConway, RG Synthesis and bioactivities of heterocyclic lipids as PAF antagonists. 2 Bioorg Med Chem Lett 5:1097-1102 (1995)    Article 
Target
Name:
Platelet-activating factor receptor
Synonyms:
PAF-R PTAFR_CAVPO Platelet-activating factor receptor
Type:
Protein
Mol. Mass.:
39005.63
Organism:
Cavia porcellus
Description:
Residue:
342
  
Inhibitor
Name:
BDBM50284414
Synonyms:
2-{[Acetyl-((2S,4R)-4-octadecylcarbamoyloxymethyl-oxetan-2-ylmethoxycarbonyl)-amino]-methyl}-1-ethyl-pyridinium; chloride CHEMBL12882
Type:
Small organic molecule
Emp. Form.:
C35H60N3O6
Mol. Mass.:
618.8669
SMILES:
(=O)OC[C@H]1C[C@@H](COC(=O)N(Cc2cccc[n+]2CC)C(C)=O)O1
: