Target
Polyunsaturated fatty acid 5-lipoxygenase
Ligand
BDBM50403379
Substrate
Meas. Tech.
ChEMBL_88003 (CHEMBL697605)
IC50
710±n/a nM
Citation
 Gallagher, TFFier-Thompson, SMGarigipati, RSSorenson, MESmietana, JMLee, DBender, PELee, JCLaydon, JTGriswold, DEChabot-Fletcher, MCBreton, JJAdams, JL 2,4,5- triarylimidazole inhibitors of IL-1 biosynthesis Bioorg Med Chem Lett 5:1171-1176 (1995)    Article 
Target
Name:
Polyunsaturated fatty acid 5-lipoxygenase
Synonyms:
5-LO 5-Lipoxygenase (5-LO) 5-Lipoygenase ALOX5 LOG5 | LOX5_HUMAN
Type:
Enzyme
Mol. Mass.:
77972.74
Organism:
Homo sapiens (Human)
Description:
Recombinant protein was purified from E. coli lysate. After ammonium sulfate precipitation and subsequent steps, the supernatant (S100) was used for 5-LO activity assay.
Residue:
674
  
Inhibitor
Name:
BDBM50403379
Synonyms:
CHEMBL277587
Type:
Small organic molecule
Emp. Form.:
C21H16FN3OS
Mol. Mass.:
377.435
SMILES:
CS(=O)c1ccccc1-c1nc(c([nH]1)-c1ccc(F)cc1)-c1ccncc1
: