Target
Beta-1/Beta-2/Beta-3 adrenergic receptor
Ligand
BDBM50284690
Substrate
Meas. Tech.
ChEMBL_39019 (CHEMBL652672)
IC50
>10000±n/a nM
Citation
 Marfat, AChambers, RCheng, JCooper, KDamon, DDelehunt, JEggler, JMasamune, HMelvin, LWatson, J The discovery of CP-96,021 and CP-96,486, balanced, combined, potent and orally active leukotriene D4 (LTD4)/platelet activating factor (PAF) receptor antagonists. Bioorg Med Chem Lett 5:1377-1382 (1995)    Article 
Target
Name:
Beta-1/Beta-2/Beta-3 adrenergic receptor
Synonyms:
Adrenergic receptor beta
Type:
Mol. Mass.:
Description:
ASSAY_ID of ChEMBL is 305577
Components:
This complex has 3 components.
Component 1
Name:
Beta-2 adrenergic receptor
Synonyms:
ADRB2 ADRB2_HUMAN Beta-2 adrenoceptor | Beta-2 adrenoreceptor
Type:
Mol. Mass.:
46461.69
Organism:
Homo sapiens (Human)
Description:
P07550
Residue:
413
  
Component 2
Name:
Beta-1 adrenergic receptor
Synonyms:
ADRB1 ADRB1_HUMAN Beta-1 adrenoceptor | adrenergic Beta1
Type:
G Protein-Coupled Receptor (GPCR)
Mol. Mass.:
51338.40
Organism:
Homo sapiens (Human)
Description:
P08588
Residue:
477
  
Component 3
Name:
Beta-3 adrenergic receptor
Synonyms:
ADRB3 ADRB3_HUMAN Beta-2 adrenergic receptor and beta-3 adrenergic receptor Beta-3 adrenoreceptor | adrenergic Beta3
Type:
G Protein-Coupled Receptor (GPCR)
Mol. Mass.:
43534.88
Organism:
Homo sapiens (Human)
Description:
Residue:
408
  
Inhibitor
Name:
BDBM50284690
Synonyms:
1-(4-{3-[(E)-2-(5-Fluoro-benzothiazol-2-yl)-vinyl]-benzyloxy}-phenyl)-2-methyl-1H-imidazo[4,5-c]pyridine CP-96021
Type:
Small organic molecule
Emp. Form.:
C29H21FN4OS
Mol. Mass.:
492.567
SMILES:
Cc1nc2cnccc2n1-c1ccc(OCc2cccc(\C=C\c3nc4cc(F)ccc4s3)c2)cc1
: