Target
Glutamate receptor ionotropic, NMDA 1
Ligand
BDBM50284813
Substrate
Meas. Tech.
ChEBML_140321
Ki
4.4±n/a nM
Citation
 Nagata, RKodo, TYamaguchi, HTanno, N Structure-activity relationships of tricyclic quinoxalinediones as potent antagonists for the glycine binding site of the NMDA receptor 2 Bioorg Med Chem Lett 5:1533-1536 (1995)    Article 
Target
Name:
Glutamate receptor ionotropic, NMDA 1
Synonyms:
Glutamate (NMDA) receptor subunit zeta 1 Glutamate-NMDA-Channel Glutamate-NMDA-Polyamine NMDA Nmdar1 | phencyclidine
Type:
Enzyme Catalytic Domain
Mol. Mass.:
105533.40
Organism:
RAT
Description:
P35439
Residue:
938
  
Inhibitor
Name:
BDBM50284813
Synonyms:
((S)-9-Chloro-6-methyl-2,3-dioxo-2,3,6,7-tetrahydro-1H,5H-pyrido[1,2,3-de]quinoxalin-5-yl)-acetic acid | CHEMBL40730
Type:
Small organic molecule
Emp. Form.:
C14H13ClN2O4
Mol. Mass.:
308.717
SMILES:
C[C@H]1Cc2cc(Cl)cc3[nH]c(=O)c(=O)n(C1CC(O)=O)c23
: