Target
Dihydroorotate dehydrogenase (quinone), mitochondrial
Ligand
BDBM50284853
Substrate
Meas. Tech.
ChEBML_54063
Ki
13±n/a nM
Citation
 Batt, DGCopeland, RADowling, RLGardner, TLJones, EAOrwat, MJPinto, DJPitts, WJMagolda, RLJaffee, BD Immunosuppressive structure-activity relationships of Brequinar and related cinchoninic acid derivatives Bioorg Med Chem Lett 5:1549-1554 (1995)    Article 
Target
Name:
Dihydroorotate dehydrogenase (quinone), mitochondrial
Synonyms:
DHODH Dihydroorotate dehydrogenase Dihydroorotate dehydrogenase, mitochondrial Dihydroorotate oxidase (DHODH) | PYRD_HUMAN
Type:
Enzyme
Mol. Mass.:
42881.33
Organism:
Homo sapiens (Human)
Description:
Q02127
Residue:
395
  
Inhibitor
Name:
BDBM50284853
Synonyms:
2-Biphenyl-4-yl-6-fluoro-3-methoxy-quinoline-4-carboxylic acid | CHEMBL40093
Type:
Small organic molecule
Emp. Form.:
C23H16FNO3
Mol. Mass.:
373.3764
SMILES:
COc1c(nc2ccc(F)cc2c1C(O)=O)-c1ccc(cc1)-c1ccccc1
: