Target
Nitric oxide synthase, endothelial
Ligand
BDBM50209245
Substrate
Meas. Tech.
ChEBML_144481
IC50
36000±n/a nM
Citation
 Hamley, PTinker*, AC 1,2-diaminobenzimidazoles : Selective inhibitors of nitric oxide synthase derived from aminoguanidine Bioorg Med Chem Lett 5:1573-1576 (1995)    Article 
Target
Name:
Nitric oxide synthase, endothelial
Synonyms:
Constitutive NOS Endothelial NOS NOS type III NOS3_HUMAN Nitric oxide synthase (inducible and endothelial) Nitric-oxide synthase (endothelial and brain) eNOS
Type:
Enzyme Catalytic Domain
Mol. Mass.:
133297.84
Organism:
Homo sapiens (Human)
Description:
P29474
Residue:
1203
  
Inhibitor
Name:
BDBM50209245
Synonyms:
CHEMBL247378
Type:
Small organic molecule
Emp. Form.:
C7H5N3O2
Mol. Mass.:
163.1335
SMILES:
[O-][N+](=O)c1cccc2cn[nH]c12
: