Target
Sterol O-acyltransferase 1
Ligand
BDBM50450313
Substrate
Meas. Tech.
ChEBML_28027
IC50
2580±n/a nM
Citation
 Wilde, RJBillheimer, JTGermain, SJGillies, PJHigley, CAKezar, HSMaduskuie, TPShimshick, ESWexler, RR Acyl CoA:cholesterol acyltransferase (ACAT) inhibitors: ureas bearing heterocyclic groups bioisosteric for an imidazole Bioorg Med Chem Lett 5:167-72 (1995)   
Target
Name:
Sterol O-acyltransferase 1
Synonyms:
ACAT-1 Acetoacetyl-CoA thiolase Acyl coenzyme A:cholesterol acyltransferase 1 Cholesterol acyltransferase 1 Soat1 | Sterol O-acyltransferase 1
Type:
PROTEIN
Mol. Mass.:
63818.83
Organism:
Mus musculus
Description:
ChEMBL_90523
Residue:
540
  
Inhibitor
Name:
BDBM50450313
Synonyms:
CHEMBL46174
Type:
Small organic molecule
Emp. Form.:
C25H36F2N4OS
Mol. Mass.:
478.641
SMILES:
CCCCCCN(CCCCCSc1nc2CCCCc2[nH]1)C(=O)Nc1ccc(F)cc1F
: