Target
Sterol O-acyltransferase 1
Ligand
BDBM50285425
Substrate
Meas. Tech.
ChEBML_28031
IC50
490±n/a nM
Citation
 Wilde, RGKlaczkiewicz, JDBillheimer, JTWexler, RRGillies, PJ Acyl CoA:cholesterol acyltransferase (ACAT) inhibitors: heterocyclic bioisosteres for the urea group in DuP 128 Bioorg Med Chem Lett 5:177-180 (1995)    Article 
Target
Name:
Sterol O-acyltransferase 1
Synonyms:
ACAT-1 Acetoacetyl-CoA thiolase Acyl coenzyme A:cholesterol acyltransferase 1 Cholesterol acyltransferase 1 Soat1 | Sterol O-acyltransferase 1
Type:
PROTEIN
Mol. Mass.:
63818.83
Organism:
Mus musculus
Description:
ChEMBL_90523
Residue:
540
  
Inhibitor
Name:
BDBM50285425
Synonyms:
(1H-Benzoimidazol-2-yl)-{5-[4,5-bis-(4-methoxy-phenyl)-1H-imidazol-2-ylsulfanyl]-pentyl}-heptyl-amine | CHEMBL53942
Type:
Small organic molecule
Emp. Form.:
C36H45N5O2S
Mol. Mass.:
611.84
SMILES:
CCCCCCCN(CCCCCSc1nc(c([nH]1)-c1ccc(OC)cc1)-c1ccc(OC)cc1)c1nc2ccccc2[nH]1
: