Target
Sterol O-acyltransferase 1
Ligand
BDBM50285422
Substrate
Meas. Tech.
ChEBML_28031
IC50
640±n/a nM
Citation
 Wilde, RGKlaczkiewicz, JDBillheimer, JTWexler, RRGillies, PJ Acyl CoA:cholesterol acyltransferase (ACAT) inhibitors: heterocyclic bioisosteres for the urea group in DuP 128 Bioorg Med Chem Lett 5:177-180 (1995)    Article 
Target
Name:
Sterol O-acyltransferase 1
Synonyms:
ACAT-1 Acetoacetyl-CoA thiolase Acyl coenzyme A:cholesterol acyltransferase 1 Cholesterol acyltransferase 1 Soat1 | Sterol O-acyltransferase 1
Type:
PROTEIN
Mol. Mass.:
63818.83
Organism:
Mus musculus
Description:
ChEMBL_90523
Residue:
540
  
Inhibitor
Name:
BDBM50285422
Synonyms:
(1-{5-[4,5-Bis-(4-methoxy-phenyl)-1H-imidazol-2-ylsulfanyl]-pentyl}-1H-benzoimidazol-2-yl)-phenyl-amine | CHEMBL50528
Type:
Small organic molecule
Emp. Form.:
C35H35N5O2S
Mol. Mass.:
589.75
SMILES:
COc1ccc(cc1)-c1nc(SCCCCCn2c(Nc3ccccc3)nc3ccccc23)[nH]c1-c1ccc(OC)cc1
: