Target
72 kDa type IV collagenase
Ligand
BDBM50285573
Substrate
Meas. Tech.
ChEBML_101914
Ki
6.1±n/a nM
Citation
 Sahoo, SPCaldwell, CGChapman, KTDurette, PLEsser, CKKopka, IEPolo, SASperow, KMNiedzwiecki, LMIzquierdo-Martin, MChang, BCHarrison, RKStein, RLMacCoss, MHagmann, WK Inhibition of matrix metalloproteinases by N-carboxyalkyl dipeptides: Enhanced potency and selectivity with substituted P1′ homophenylalanines Bioorg Med Chem Lett 5:2441-2446 (1995)    Article 
Target
Name:
72 kDa type IV collagenase
Synonyms:
72 kDa gelatinase CLG4A Gelatinase A (MMP-2) MMP2_HUMAN Matrix metalloproteinase-2 (MMP 2) Matrix metalloproteinases 2 (MMP-2) | TBE-1
Type:
Enzyme
Mol. Mass.:
73870.36
Organism:
Homo sapiens (Human)
Description:
P08253
Residue:
660
  
Inhibitor
Name:
BDBM50285573
Synonyms:
(R)-2-[(S)-3-(4-ethoxy-phenyl)-1-((S)-4-guanidino-1-phenylcarbamoyl-butylcarbamoyl)-propylamino]-propionic acid | CHEMBL400163
Type:
Small organic molecule
Emp. Form.:
C27H38N6O5
Mol. Mass.:
526.6278
SMILES:
[#6]-[#6]-[#8]-c1ccc(-[#6]-[#6]-[#6@H](-[#7]-[#6@H](-[#6])-[#6](-[#8])=O)-[#6](=O)-[#7]-[#6@@H](-[#6]-[#6]-[#6]\[#7]=[#6](\[#7])-[#7])-[#6](=O)-[#7]-c2ccccc2)cc1
: