Target
Platelet-activating factor receptor
Ligand
BDBM50285987
Substrate
Meas. Tech.
ChEBML_155158
Ki
19±n/a nM
Citation
 Holms, JHDavidsen, SKSheppard, GSCarrera, GMCurtin, NLHeyman, HRPireh, DSteinman, DHAlbert, DHConway, RGLuo, GMagoc, TJTapang, PRhein, DASummers, JB Discovery and optimization of indole pyrrolothiazole paf antagonists Bioorg Med Chem Lett 5:2903-2908 (1995)    Article 
Target
Name:
Platelet-activating factor receptor
Synonyms:
PAF-R PTAFR_CAVPO Platelet-activating factor receptor
Type:
Protein
Mol. Mass.:
39005.63
Organism:
Cavia porcellus
Description:
Residue:
342
  
Inhibitor
Name:
BDBM50285987
Synonyms:
6-(4-Fluoro-phenyl)-3-(3-pyridin-3-yl-1H-pyrrolo[1,2-c]thiazole-7-carbonyl)-indole-1-carboxylic acid ethylamide | CHEMBL100150
Type:
Small organic molecule
Emp. Form.:
C29H23FN4O2S
Mol. Mass.:
510.582
SMILES:
CCNC(=O)n1cc(C(=O)c2ccn3C(SCc23)c2cccnc2)c2ccc(cc12)-c1ccc(F)cc1
: