Target
Neutrophil elastase
Ligand
BDBM50286330
Substrate
Meas. Tech.
ChEMBL_86690 (CHEMBL694281)
Ki
2±n/a nM
Citation
 Hlasta, DJBell, MRCourt, JJCundy, KCDesai, RCFerguson, EWGordon, RJKumar, VMaycock, ALSubramanyam, CDunlap, RPEiff, SLFranke, CAMura, AJRowlands, AG The design of potent and stable benzisothiazolone inhibitors of human leukocyte elastase Bioorg Med Chem Lett 5:331-336 (1995)    Article 
Target
Name:
Neutrophil elastase
Synonyms:
Bone marrow serine protease Coagulation factor X ELANE Elastase HLE Leukocyte elastase Medullasin Neutrophil elastase (HNE) PMN elastase Trypsin
Type:
Enzyme
Mol. Mass.:
28532.38
Organism:
Homo sapiens (Human)
Description:
P08246
Residue:
267
  
Inhibitor
Name:
BDBM50286330
Synonyms:
4,5-Dimethoxy-1,1-dioxo-2-(1-phenyl-1H-tetrazol-5-ylsulfanylmethyl)-1,2-dihydro-1lambda*6*-benzo[d]isothiazol-3-one | CHEMBL100620
Type:
Small organic molecule
Emp. Form.:
C17H15N5O5S2
Mol. Mass.:
433.462
SMILES:
COc1ccc2c(C(=O)N(CSc3nnnn3-c3ccccc3)S2(=O)=O)c1OC
: