Target
Interstitial collagenase
Ligand
BDBM50286344
Substrate
Meas. Tech.
ChEBML_49511
Ki
1±n/a nM
Citation
 Singh, JConzentino, PCundy, KGainor, JAGilliam, CLGordon, TDJohnson, JAMorgan, BASchneider, EDWahl, RCWhipple, DA Relationship between structure and bioavailability in a series of hydroxamate based metalloprotease inhibitors Bioorg Med Chem Lett 5:337-342 (1995)    Article 
Target
Name:
Interstitial collagenase
Synonyms:
CLG MMP1 Matrix metalloproteinase-1 | Matrix metalloproteinase-1 (MMP-1)
Type:
Enzyme
Mol. Mass.:
54010.26
Organism:
Homo sapiens (Human)
Description:
P03956
Residue:
469
  
Inhibitor
Name:
BDBM50286344
Synonyms:
5-[(S)-2-((R)-2-Hydroxycarbamoylmethyl-4-methyl-pentanoylamino)-3-(1H-indol-3-yl)-propionylamino]-pentanoic acid | CHEMBL324947
Type:
Small organic molecule
Emp. Form.:
C24H34N4O6
Mol. Mass.:
474.55
SMILES:
CC(C)C[C@H](CC(=O)NO)C(=O)N[C@@H](Cc1c[nH]c2ccccc12)C(=O)NCCCCC(O)=O
: