Target
Interstitial collagenase
Ligand
BDBM50286350
Substrate
Meas. Tech.
ChEBML_49511
Ki
3±n/a nM
Citation
 Singh, JConzentino, PCundy, KGainor, JAGilliam, CLGordon, TDJohnson, JAMorgan, BASchneider, EDWahl, RCWhipple, DA Relationship between structure and bioavailability in a series of hydroxamate based metalloprotease inhibitors Bioorg Med Chem Lett 5:337-342 (1995)    Article 
Target
Name:
Interstitial collagenase
Synonyms:
CLG MMP1 Matrix metalloproteinase-1 | Matrix metalloproteinase-1 (MMP-1)
Type:
Enzyme
Mol. Mass.:
54010.26
Organism:
Homo sapiens (Human)
Description:
P03956
Residue:
469
  
Inhibitor
Name:
BDBM50286350
Synonyms:
(R)-N*4*-Hydroxy-N*1*-[(S)-2-(1H-indol-3-yl)-1-(2-methanesulfonyl-ethylcarbamoyl)-ethyl]-2-isobutyl-succinamide | CHEMBL325214
Type:
Small organic molecule
Emp. Form.:
C22H32N4O6S
Mol. Mass.:
480.578
SMILES:
CC(C)C[C@H](CC(=O)NO)C(=O)N[C@@H](Cc1c[nH]c2ccccc12)C(=O)NCCS(C)(=O)=O
: