Target
Neutrophil collagenase
Ligand
BDBM50031772
Substrate
Meas. Tech.
ChEBML_102111
Ki
2±n/a nM
Citation
 Tomczuk, BEGowravaram, MRJohnson, JSDelecki, DCook, ERGhose, AKMathiowetz, AMSpurlino, JCRubin, BSmith, DLPulvino, TWahl, RC Hydroxamate inhibitors of the matrix metallo-proteinases (MMPs) containing novel P1′ heteroatom based modifications Bioorg Med Chem Lett 5:343-348 (1995)    Article 
Target
Name:
Neutrophil collagenase
Synonyms:
CLG1 MMP8 Matrix metalloproteinase-8 PMNL collagenase | PMNL-CL
Type:
Enzyme
Mol. Mass.:
53413.48
Organism:
Homo sapiens (Human)
Description:
P22894
Residue:
467
  
Inhibitor
Name:
BDBM50031772
Synonyms:
(R)-3-((S)-1-Methylcarbamoyl-2-phenyl-ethylcarbamoyl)-heptanedioic acid 1-hydroxyamide 7-propylamide CHEMBL85766
Type:
Small organic molecule
Emp. Form.:
C21H32N4O5
Mol. Mass.:
420.5026
SMILES:
CCCNC(=O)CCC[C@H](CC(=O)NO)C(=O)N[C@@H](Cc1ccccc1)C(=O)NC
: