Target
Cysteinyl leukotriene receptor 1
Ligand
BDBM50286746
Substrate
Meas. Tech.
ChEBML_99991
Ki
1300±n/a nM
Citation
 Masamune, HBreslow, RCheng, JBConklyn, MJEggler, JFMarfat, AMelvin, LSPillar, JSShirley, JTShowell, HJTickner, JE Synthesis and in vitro profile of 7-substituted quinoline chromanols as novel, non-acidic LTB4 antagonists Bioorg Med Chem Lett 5:887-892 (1995)    Article 
Target
Name:
Cysteinyl leukotriene receptor 1
Synonyms:
CLTR1_CAVPO | CYSLTR1
Type:
Enzyme Catalytic Domain
Mol. Mass.:
39007.58
Organism:
GUINEA PIG
Description:
Leukotriene D4 0 GUINEA PIG::Q2NNR5
Residue:
340
  
Inhibitor
Name:
BDBM50286746
Synonyms:
(3S,4S)-3-Pyridin-3-ylmethyl-7-(quinolin-2-ylmethoxy)-chroman-4-ol | CHEMBL169743
Type:
Small organic molecule
Emp. Form.:
C25H22N2O3
Mol. Mass.:
398.4538
SMILES:
O[C@H]1[C@@H](Cc2cccnc2)COc2cc(OCc3ccc4ccccc4n3)ccc12
: