Target
Proto-oncogene tyrosine-protein kinase Src
Ligand
BDBM50060735
Substrate
Meas. Tech.
ChEBML_154714
IC50
2800±n/a nM
Citation
 Shahripour, APlummer, MSLunney, EAPara, KSStankovic, CJRubin, JRHumblet, CFergus, JHMarks, JSHerrera, RHubbell, SESaltiel, ARSawyer, TK Novel phosphotyrosine mimetics in the design of peptide ligands for pp60src SH2 domain Bioorg Med Chem Lett 6:1209-1214 (1996)    Article 
Target
Name:
Proto-oncogene tyrosine-protein kinase Src
Synonyms:
Calmodulin/Proto-oncogene tyrosine-protein kinase Src Proto-oncogene c-Src SRC SRC_HUMAN V-src sarcoma (Schmidt-Ruppin A-2) viral oncogene homolog (avian) p60-Src | pp60c-src
Type:
Protein
Mol. Mass.:
59838.60
Organism:
Homo sapiens (Human)
Description:
P12931
Residue:
536
  
Inhibitor
Name:
BDBM50060735
Synonyms:
2-[2-(2-{2-[(S)-2-Acetylamino-3-(4-phosphonooxy-phenyl)-propionylamino]-4-carboxy-butyrylamino}-4-carboxy-butyrylamino)-3-methyl-pentanoylamino]-pentanedioic acid | CHEMBL299477
Type:
Small organic molecule
Emp. Form.:
C32H46N5O17P
Mol. Mass.:
803.7047
SMILES:
CC[C@H](C)[C@H](NC(=O)[C@H](CCC(O)=O)NC(=O)[C@H](CCC(O)=O)NC(=O)[C@H](Cc1ccc(OP(O)(O)=O)cc1)NC(C)=O)C(=O)N[C@@H](CCC(O)=O)C(O)=O
: