Target
Epidermal growth factor receptor
Ligand
BDBM50175493
Substrate
Meas. Tech.
ChEBML_63607
IC50
>50000±n/a nM
Citation
 Zimmermann, JBuchdunger, EMett, HMeyer, TLydon, NBTraxler, P Phenylamino-pyrimidine (PAP) — derivatives: a new class of potent and highly selective PDGF-receptor autophosphorylation inhibitors Bioorg Med Chem Lett 6:1221-1226 (1996)    Article 
Target
Name:
Epidermal growth factor receptor
Synonyms:
EGF Receptor Substrate EGFR_HUMAN ERBB1 Epidermal Growth Factor Receptor erbB-1 Epidermal growth factor receptor (EGFR) HER1 Proto-oncogene c-ErbB-1 Tyrosine-Protein Kinase ErbB-1
Type:
Receptor Kinase Domain
Mol. Mass.:
134279.59
Organism:
Homo sapiens (Human)
Description:
P00533
Residue:
1210
  
Inhibitor
Name:
BDBM50175493
Synonyms:
CHEMBL277931 | N-[3-(4-Pyridin-3-yl-pyrimidin-2-ylamino)-phenyl]-benzamide
Type:
Small organic molecule
Emp. Form.:
C22H17N5O
Mol. Mass.:
367.4033
SMILES:
O=C(Nc1cccc(Nc2nccc(n2)-c2cccnc2)c1)c1ccccc1
: