Target
D(3) dopamine receptor
Ligand
BDBM50071960
Substrate
Meas. Tech.
ChEMBL_62290 (CHEMBL675060)
Ki
8±n/a nM
Citation
 Glase, SAAkunne, HCHeffner, TGJohnson, SJKesten, SRMacKenzie, RGManley, PJPugsley, TAWright, JLWise, LD 4-bromo-1-methoxy-N-[2-(4-aryl-1-piperazinyl)ethyl]-2-naphthalenecarboxamides: Selective dopamine D3 receptor partial agonists Bioorg Med Chem Lett 6:1361-1366 (1996)    Article 
Target
Name:
D(3) dopamine receptor
Synonyms:
DOPAMINE D3 DRD3_HUMAN Dopamine D3 receptor (D3) Dopamine receptor Dopamine receptor D3
Type:
Mol. Mass.:
44243.43
Organism:
Homo sapiens (Human)
Description:
Residue:
400
  
Inhibitor
Name:
BDBM50071960
Synonyms:
4-Bromo-1-methoxy-naphthalene-2-carboxylic acid {2-[4-(2,3-dichloro-phenyl)-piperazin-1-yl]-ethyl}-amide | CHEMBL287198
Type:
Small organic molecule
Emp. Form.:
C24H24BrCl2N3O2
Mol. Mass.:
537.276
SMILES:
COc1c(cc(Br)c2ccccc12)C(=O)NCCN1CCN(CC1)c1cccc(Cl)c1Cl
: