Target
Stromelysin-1
Ligand
BDBM50287377
Substrate
Meas. Tech.
ChEBML_205490
IC50
20±n/a nM
Citation
 Chen, JJZhang, YHammond, SDewdney, NHo, TLin, XBrowner, MFCastelhano, AL Design, synthesis, activity, and structure of a novel class of matrix metalloproteinase inhibitors containing a heterocyclic P2′-P3′ amide bond isostere Bioorg Med Chem Lett 6:1601-1606 (1996)    Article 
Target
Name:
Stromelysin-1
Synonyms:
MMP-3 MMP3_HUMAN Matrix metalloproteinase 3 Matrix metalloproteinase-3 (MMP-3) SL-1 Stromelysin 1 | Transin-1
Type:
Enzyme
Mol. Mass.:
53973.13
Organism:
Homo sapiens (Human)
Description:
P08254
Residue:
477
  
Inhibitor
Name:
BDBM50287377
Synonyms:
(R)-N*4*-Hydroxy-2-isobutyl-N*1*-[(S)-3-methyl-1-(6-trifluoromethyl-1H-benzoimidazol-2-yl)-butyl]-succinamide | CHEMBL289513
Type:
Small organic molecule
Emp. Form.:
C21H29F3N4O3
Mol. Mass.:
442.4752
SMILES:
CC(C)C[C@H](CC(=O)NO)C(=O)N[C@@H](CC(C)C)c1nc2ccc(cc2[nH]1)C(F)(F)F
: