Target
Protein kinase C beta type
Ligand
BDBM3201
Substrate
Meas. Tech.
ChEBML_153132
IC50
10±n/a nM
Citation
 Jr., GEDefauw, JMLampe, JWDarges, JWKalter, K Potent and selective PKC inhibitory 5-membered ring analogs of balanol with replacement of the carboxamide moiety Bioorg Med Chem Lett 6:1759-1764 (1996)    Article 
Target
Name:
Protein kinase C beta type
Synonyms:
KPCB_HUMAN PKC beta PKCB PRKCB1 Protein kinase C beta type | Protein kinase C beta type II (PRKCB2)
Type:
Enzyme
Mol. Mass.:
76873.67
Organism:
Homo sapiens (Human)
Description:
The recombinant human PKC enzymes were produced using a baculovirus expression system in SF9 cells
Residue:
671
  
Inhibitor
Name:
BDBM3201
Synonyms:
(+-)-anti-3-[[4-(6-Carboxy-2-hydroxybenzoyl)-3,5-hydroxybenzoyl]oxy]-4-(4-hydroxybenzyl)pyrrolidine, Trifluoroacetic Acid Salt Acyclic Balanol Analog 35b
Type:
Small organic molecule
Emp. Form.:
C26H23NO9
Mol. Mass.:
493.4621
SMILES:
OC(=O)c1cccc(O)c1C(=O)c1c(O)cc(cc1O)C(=O)O[C@@H]1CNC[C@H]1Cc1ccc(O)cc1
: