Target
Adenosine receptor A1
Ligand
BDBM50079652
Substrate
Meas. Tech.
ChEMBL_28534 (CHEMBL875874)
IC50
10100±n/a nM
Citation
 Akahane, AKatayama, HMitsunaga, TKita, YKusunoki, TTerai, TYoshida, KShiokawa, Y Discovery of FK453, a novel non-xanthine adenosine A1 receptor antagonist Bioorg Med Chem Lett 6:2059-2062 (1996)    Article 
Target
Name:
Adenosine receptor A1
Synonyms:
AA1R_RAT ADENOSINE A1 high Adenosine A1 receptor (A1) Adenosine receptors A1 | Adora1
Type:
Protein
Mol. Mass.:
36704.13
Organism:
Rattus norvegicus (rat)
Description:
Residue:
326
  
Inhibitor
Name:
BDBM50079652
Synonyms:
(E)-1-[(R)-2-(2-Hydroxy-ethyl)-piperidin-1-yl]-3-(2-phenyl-pyrazolo[1,5-a]pyridin-3-yl)-propenone 1-[2-(2-Hydroxy-ethyl)-piperidin-1-yl]-3-(2-phenyl-pyrazolo[1,5-a]pyridin-3-yl)-propenone FK-453
Type:
Small organic molecule
Emp. Form.:
C23H25N3O2
Mol. Mass.:
375.4635
SMILES:
OCC[C@H]1CCCCN1C(=O)\C=C\c1c(nn2ccccc12)-c1ccccc1
: