Target
Peroxisome proliferator-activated receptor gamma
Ligand
BDBM50287727
Substrate
Meas. Tech.
ChEBML_153639
Ki
33±n/a nM
Citation
 Buckle, DRCantello, BCCawthorne, MACoyle, PJDean, DKFaller, AHaigh, DHindley, RMJefcott, LJLister, CAPinto, ILRami, HKSmith, DGSmith, SA Non thiazolidinedione antihyperglycaemic agents. 1: α-Heteroatom substituted β-phenylpropanoic acids Bioorg Med Chem Lett 6:2121-2126 (1996)    Article 
Target
Name:
Peroxisome proliferator-activated receptor gamma
Synonyms:
NR1C3 PPAR-gamma PPARG_HUMAN Peroxisome proliferator-activated receptor gamma (PPAR gamma) Peroxisome proliferator-activated receptor gamma (PPARĪ³) peroxisome proliferator-activated receptor gamma isoform 2
Type:
Nuclear Receptor
Mol. Mass.:
57613.46
Organism:
Homo sapiens (Human)
Description:
P37231
Residue:
505
  
Inhibitor
Name:
BDBM50287727
Synonyms:
3-{4-[2-(Benzooxazol-2-yl-methyl-amino)-ethoxy]-phenyl}-2-chloro-propionic acid | CHEMBL67098
Type:
Small organic molecule
Emp. Form.:
C19H19ClN2O4
Mol. Mass.:
374.818
SMILES:
CN(CCOc1ccc(CC(Cl)C(O)=O)cc1)c1nc2ccccc2o1
: