Target
Peroxisome proliferator-activated receptor gamma
Ligand
BDBM50287734
Substrate
Meas. Tech.
ChEBML_153641
Ki
1500±n/a nM
Citation
 Buckle, DRCantello, BCCawthorne, MACoyle, PJDean, DKFaller, AHaigh, DHindley, RMJefcott, LJLister, CAPinto, ILRami, HKSmith, DGSmith, SA Non thiazolidinedione antihyperglycaemic agents. 2: α-Carbon substituted β-phenylpropanoic acids1 Bioorg Med Chem Lett 6:2127-2130 (1996)    Article 
Target
Name:
Peroxisome proliferator-activated receptor gamma
Synonyms:
NR1C3 PPAR-gamma PPARG_HUMAN Peroxisome proliferator-activated receptor gamma (PPAR gamma) Peroxisome proliferator-activated receptor gamma (PPARĪ³) peroxisome proliferator-activated receptor gamma isoform 2
Type:
Nuclear Receptor
Mol. Mass.:
57613.46
Organism:
Homo sapiens (Human)
Description:
P37231
Residue:
505
  
Inhibitor
Name:
BDBM50287734
Synonyms:
3-{4-[2-(Benzooxazol-2-yl-methyl-amino)-ethoxy]-phenyl}-2-methyl-propionic acid | CHEMBL303389
Type:
Small organic molecule
Emp. Form.:
C20H22N2O4
Mol. Mass.:
354.3997
SMILES:
CC(Cc1ccc(OCCN(C)c2nc3ccccc3o2)cc1)C(O)=O
: