Target
Neprilysin
Ligand
BDBM50024096
Substrate
Meas. Tech.
ChEBML_144431
Ki
1.7±n/a nM
Citation
 Danvy, DMonteil, TPlaquevent, JCDuhamel, LDuhamel, PGros, CNoël, NSchwartz, JCLecomte, JM Studies on the structural feature of S'1 subsite of neprilysin (EC.3.4.24.11): Stereochemical requirement for the enzyme-inhibitor docking process Bioorg Med Chem Lett 6:2437-2440 (1996)    Article 
Target
Name:
Neprilysin
Synonyms:
Atriopeptidase CD_antigen=CD10 EPN MME NEP_HUMAN Neutral endopeptidase | Neutral endopeptidase 24.11
Type:
Enzyme
Mol. Mass.:
85505.38
Organism:
Homo sapiens (Human)
Description:
P08473
Residue:
750
  
Inhibitor
Name:
BDBM50024096
Synonyms:
((R)-2-Mercaptomethyl-3-phenyl-propionylamino)-acetic acid (R) (2-Mercaptomethyl-3-phenyl-propionylamino)-acetic acid | CHEMBL61512
Type:
Small organic molecule
Emp. Form.:
C12H15NO3S
Mol. Mass.:
253.317
SMILES:
OC(=O)CNC(=O)[C@H](CS)Cc1ccccc1
: