Target
Capsid scaffolding protein
Ligand
BDBM50288093
Substrate
Meas. Tech.
ChEBML_158781
IC50
15000±n/a nM
Citation
 Jarvest, RLParratt, MJDebouck, CMGorniak, JGJennings, LJSerafinowska, HTStrickler, JE Inhibition of HSV-1 protease by benzoxazinones Bioorg Med Chem Lett 6:2463-2466 (1996)    Article 
Target
Name:
Capsid scaffolding protein
Synonyms:
Human herpesvirus 1 protease UL26
Type:
PROTEIN
Mol. Mass.:
66472.05
Organism:
Human herpesvirus 1 (strain 17) (HHV-1) (Human herpes simplex virus1)
Description:
ChEMBL_158648
Residue:
635
  
Inhibitor
Name:
BDBM50288093
Synonyms:
2-Allyloxy-benzo[d][1,3]oxazin-4-one | CHEMBL81469
Type:
Small organic molecule
Emp. Form.:
C11H9NO3
Mol. Mass.:
203.1941
SMILES:
C=CCOc1nc2ccccc2c(=O)o1
: