Target
Capsid scaffolding protein
Ligand
BDBM50288096
Substrate
Meas. Tech.
ChEBML_158781
IC50
7000±n/a nM
Citation
 Jarvest, RLParratt, MJDebouck, CMGorniak, JGJennings, LJSerafinowska, HTStrickler, JE Inhibition of HSV-1 protease by benzoxazinones Bioorg Med Chem Lett 6:2463-2466 (1996)    Article 
Target
Name:
Capsid scaffolding protein
Synonyms:
Human herpesvirus 1 protease UL26
Type:
PROTEIN
Mol. Mass.:
66472.05
Organism:
Human herpesvirus 1 (strain 17) (HHV-1) (Human herpes simplex virus1)
Description:
ChEMBL_158648
Residue:
635
  
Inhibitor
Name:
BDBM50288096
Synonyms:
5-Chloro-2-ethoxy-benzo[d][1,3]oxazin-4-one | CHEMBL79597
Type:
Small organic molecule
Emp. Form.:
C10H8ClNO3
Mol. Mass.:
225.628
SMILES:
CCOc1nc2cccc(Cl)c2c(=O)o1
: