Target
Endothelin-1 receptor
Ligand
BDBM50288272
Substrate
Meas. Tech.
ChEBML_65477
IC50
3390±n/a nM
Citation
 Raju, BWu, CKois, AVerner, EOkun, IStavros, FChan, MF Thiophenesulfonamides as endothelin receptor antagonists Bioorg Med Chem Lett 6:2651-2656 (1996)    Article 
Target
Name:
Endothelin-1 receptor
Synonyms:
EDNRA ET-A ETA-R Endothelin receptor type A hET-AR
Type:
Enzyme Catalytic Domain
Mol. Mass.:
48736.88
Organism:
Homo sapiens (Human)
Description:
P25101
Residue:
427
  
Inhibitor
Name:
BDBM50288272
Synonyms:
4-Phenyl-thiophene-2-sulfonic acid (4-bromo-3-methyl-isoxazol-5-yl)-amide | CHEMBL329375
Type:
Small organic molecule
Emp. Form.:
C14H11BrN2O3S2
Mol. Mass.:
399.283
SMILES:
Cc1noc(NS(=O)(=O)c2cc(cs2)-c2ccccc2)c1Br
: