Target
Prothrombin
Ligand
BDBM50288404
Substrate
Meas. Tech.
ChEBML_208357
Ki
4.7±n/a nM
Citation
 Galemmo, RAFevig, JMCarini, DJCacciola, JWells, BLHillyer, GLJr., JBRossi, KAStouten, PFAlexander, RSHilmer, RBostrom, LAbelman, MMLee, SLWeber, PCKettner, CAKnabb, RMWexler, RR (N-acyl-N-alkyl)glycyl borolysine analogs: A new class of potent thrombin inhibitors Bioorg Med Chem Lett 6:2913-2918 (1996)    Article 
Target
Name:
Prothrombin
Synonyms:
Activation peptide fragment 1 Coagulation factor II Prothrombin precursor Thrombin heavy chain | Thrombin light chain
Type:
Protein
Mol. Mass.:
70029.57
Organism:
Homo sapiens (Human)
Description:
P00734
Residue:
622
  
Inhibitor
Name:
BDBM50288404
Synonyms:
CHEMBL101707 | N-[(5-Amino-1-dihydroxyboranyl-pentylcarbamoyl)-methyl]-N-benzyl-3-phenyl-propionamide
Type:
Small organic molecule
Emp. Form.:
C23H32BN3O4
Mol. Mass.:
425.329
SMILES:
NCCCC[C@H](NC(=O)CN(Cc1ccccc1)C(=O)CCc1ccccc1)B(O)O
: