Target
Prothrombin
Ligand
BDBM50288408
Substrate
Meas. Tech.
ChEBML_225479
Ki
100±n/a nM
Citation
 Galemmo, RAFevig, JMCarini, DJCacciola, JWells, BLHillyer, GLJr., JBRossi, KAStouten, PFAlexander, RSHilmer, RBostrom, LAbelman, MMLee, SLWeber, PCKettner, CAKnabb, RMWexler, RR (N-acyl-N-alkyl)glycyl borolysine analogs: A new class of potent thrombin inhibitors Bioorg Med Chem Lett 6:2913-2918 (1996)    Article 
Target
Name:
Prothrombin
Synonyms:
Activation peptide fragment 1 Coagulation factor II Prothrombin Thrombin Thrombin light chain
Type:
Enzyme
Mol. Mass.:
70502.73
Organism:
Bos taurus (Bovine)
Description:
P00735
Residue:
625
  
Inhibitor
Name:
BDBM50288408
Synonyms:
1-(3-Phenyl-propionyl)-pyrrolidine-2-carboxylic acid (5-amino-1-dihydroxyboranyl-pentyl)-amide | CHEMBL320897
Type:
Small organic molecule
Emp. Form.:
C19H30BN3O4
Mol. Mass.:
375.27
SMILES:
NCCCC[C@H](NC(=O)[C@@H]1CCCN1C(=O)CCc1ccccc1)B(O)O
: