Target
Stromelysin-1
Ligand
BDBM50288681
Substrate
Meas. Tech.
ChEBML_102081
Ki
5.7±n/a nM
Citation
 Caldwell, CGSahoo, SPPolo, SAEversole, RRLanza, TJMills, SGNiedzwiecki, LMIzquierdo-Martin, MChang, BCHarrison, RKKuo, DWLin, TYStein, RLDurette, PLHagmann, WK Phosphinic acid inhibitors of matrix metalloproteinases Bioorg Med Chem Lett 6:323-328 (1996)    Article 
Target
Name:
Stromelysin-1
Synonyms:
MMP-3 MMP3_HUMAN Matrix metalloproteinase 3 Matrix metalloproteinase-3 (MMP-3) SL-1 Stromelysin 1 | Transin-1
Type:
Enzyme
Mol. Mass.:
53973.13
Organism:
Homo sapiens (Human)
Description:
P08254
Residue:
477
  
Inhibitor
Name:
BDBM50288681
Synonyms:
(4-Benzoylamino-butyl)-[(S)-2-((S)-3-methyl-1-phenylcarbamoyl-butylcarbamoyl)-4-phenyl-butyl]-phosphinic acid | CHEMBL321005
Type:
Small organic molecule
Emp. Form.:
C34H44N3O5P
Mol. Mass.:
605.704
SMILES:
CC(C)C[C@H](NC(=O)[C@H](CCc1ccccc1)CP(O)(=O)CCCCNC(=O)c1ccccc1)C(=O)Nc1ccccc1
: