Target
Adenosine receptor A1
Ligand
BDBM50053947
Substrate
Meas. Tech.
ChEBML_28844
Ki
0.740000±n/a nM
Citation
 Poulsen, SAQuin, RJ Pyrazolo[3,4-d]pyrimidines: C4, C6 substitution leads to adenosine A1 receptor selectivity Bioorg Med Chem Lett 6:357-360 (1996)    Article 
Target
Name:
Adenosine receptor A1
Synonyms:
AA1R_RAT ADENOSINE A1 high Adenosine A1 receptor (A1) Adenosine receptors A1 | Adora1
Type:
Protein
Mol. Mass.:
36704.13
Organism:
Rattus norvegicus (rat)
Description:
Residue:
326
  
Inhibitor
Name:
BDBM50053947
Synonyms:
2-(4-Methylamino-1-phenyl-1H-pyrazolo[3,4-d]pyrimidin-6-ylsulfanyl)-hexanoic acid amide | CHEMBL60962
Type:
Small organic molecule
Emp. Form.:
C18H22N6OS
Mol. Mass.:
370.472
SMILES:
CCCCC(Sc1nc(NC)c2cnn(-c3ccccc3)c2n1)C(N)=O
: