Target
Amine oxidase [flavin-containing] A
Ligand
BDBM50231956
Substrate
Meas. Tech.
ChEBML_100063
IC50
540±n/a nM
Citation
 Fink, DMPalermo, MGBores, GMHuger, FPKurys, BEMerriman, MCOlsen, GEPetko, WO'Malley, GJ Imino 1,2,3,4-tetrahydrocyclopent[b]indole carbamates as dual inhibitors of acetylcholinesterase and monoamine oxidase Bioorg Med Chem Lett 6:625-630 (1996)    Article 
Target
Name:
Amine oxidase [flavin-containing] A
Synonyms:
AOFA_HUMAN MAO-A Monoamine oxidase Monoamine oxidase type A (MAO A) Monoamine oxidase type A (MAOA)
Type:
Protein
Mol. Mass.:
59689.53
Organism:
Homo sapiens (Human)
Description:
P21397
Residue:
527
  
Inhibitor
Name:
BDBM50231956
Synonyms:
(Z)-8-bromo-4-methyl-3-(methylimino)-1,2,3,4-tetrahydrocyclopenta[b]indol-7-yl dimethylcarbamate Dimethyl-carbamic acid 8-bromo-4-methyl-3-[(Z)-methylimino]-1,2,3,4-tetrahydro-cyclopenta[b]indol-7-yl ester
Type:
Small organic molecule
Emp. Form.:
C16H18BrN3O2
Mol. Mass.:
364.237
SMILES:
CN=C1CCc2c1n(C)c1ccc(OC(=O)N(C)C)c(Br)c21
: