Target
Amine oxidase [flavin-containing] A
Ligand
BDBM50288974
Substrate
Meas. Tech.
ChEBML_100063
IC50
25400±n/a nM
Citation
 Fink, DMPalermo, MGBores, GMHuger, FPKurys, BEMerriman, MCOlsen, GEPetko, WO'Malley, GJ Imino 1,2,3,4-tetrahydrocyclopent[b]indole carbamates as dual inhibitors of acetylcholinesterase and monoamine oxidase Bioorg Med Chem Lett 6:625-630 (1996)    Article 
Target
Name:
Amine oxidase [flavin-containing] A
Synonyms:
AOFA_HUMAN MAO-A Monoamine oxidase Monoamine oxidase type A (MAO A) Monoamine oxidase type A (MAOA)
Type:
Protein
Mol. Mass.:
59689.53
Organism:
Homo sapiens (Human)
Description:
P21397
Residue:
527
  
Inhibitor
Name:
BDBM50288974
Synonyms:
CHEMBL155863 | Methyl-carbamic acid 4-methyl-3-[(Z)-propylimino]-1,2,3,4-tetrahydro-cyclopenta[b]indol-7-yl ester
Type:
Small organic molecule
Emp. Form.:
C17H21N3O2
Mol. Mass.:
299.3675
SMILES:
CCCN=C1CCc2c1n(C)c1ccc(OC(=O)NC)cc21
: