Target
Amine oxidase [flavin-containing] A
Ligand
BDBM50288979
Substrate
Meas. Tech.
ChEBML_100063
IC50
1360±n/a nM
Citation
 Fink, DMPalermo, MGBores, GMHuger, FPKurys, BEMerriman, MCOlsen, GEPetko, WO'Malley, GJ Imino 1,2,3,4-tetrahydrocyclopent[b]indole carbamates as dual inhibitors of acetylcholinesterase and monoamine oxidase Bioorg Med Chem Lett 6:625-630 (1996)    Article 
Target
Name:
Amine oxidase [flavin-containing] A
Synonyms:
AOFA_HUMAN MAO-A Monoamine oxidase Monoamine oxidase type A (MAO A) Monoamine oxidase type A (MAOA)
Type:
Protein
Mol. Mass.:
59689.53
Organism:
Homo sapiens (Human)
Description:
P21397
Residue:
527
  
Inhibitor
Name:
BDBM50288979
Synonyms:
CHEMBL155754 | Methyl-carbamic acid 8-chloro-4-methyl-3-[(Z)-methylimino]-1,2,3,4-tetrahydro-cyclopenta[b]indol-7-yl ester
Type:
Small organic molecule
Emp. Form.:
C15H16ClN3O2
Mol. Mass.:
305.759
SMILES:
CNC(=O)Oc1ccc2n(C)c3C(CCc3c2c1Cl)=NC
: