Target
Complement C1r subcomponent
Ligand
BDBM50288996
Substrate
Meas. Tech.
ChEMBL_40171 (CHEMBL655966)
IC50
35400±n/a nM
Citation
 Gilmore, JLHays, SJCaprathe, BWLee, CEmmerling, MRMichael, WJaen, JC Synthesis and evaluation of 2-aryl-4H-3,1-benzoxazin-4-ones as C1r serine protease inhibitors Bioorg Med Chem Lett 6:679-682 (1996)    Article 
Target
Name:
Complement C1r subcomponent
Synonyms:
C1R Complement C1r | Complement C1r subcomponent
Type:
Enzyme
Mol. Mass.:
80113.65
Organism:
Homo sapiens (Human)
Description:
P00736
Residue:
705
  
Inhibitor
Name:
BDBM50288996
Synonyms:
2-(2-Trifluoromethyl-phenyl)-benzo[d][1,3]oxazin-4-one | CHEMBL352443
Type:
Small organic molecule
Emp. Form.:
C15H8F3NO2
Mol. Mass.:
291.2247
SMILES:
FC(F)(F)c1ccccc1-c1nc2ccccc2c(=O)o1
: