Target
Complement C1r subcomponent
Ligand
BDBM50289013
Substrate
Meas. Tech.
ChEMBL_40172 (CHEMBL655967)
IC50
>62500±n/a nM
Citation
 Gilmore, JLHays, SJCaprathe, BWLee, CEmmerling, MRMichael, WJaen, JC Synthesis and evaluation of 2-aryl-4H-3,1-benzoxazin-4-ones as C1r serine protease inhibitors Bioorg Med Chem Lett 6:679-682 (1996)    Article 
Target
Name:
Complement C1r subcomponent
Synonyms:
C1R Complement C1r | Complement C1r subcomponent
Type:
Enzyme
Mol. Mass.:
80113.65
Organism:
Homo sapiens (Human)
Description:
P00736
Residue:
705
  
Inhibitor
Name:
BDBM50289013
Synonyms:
2-(3-Iodo-phenyl)-benzo[d][1,3]oxazin-4-one | CHEMBL158801
Type:
Small organic molecule
Emp. Form.:
C14H8INO2
Mol. Mass.:
349.1233
SMILES:
Ic1cccc(c1)-c1nc2ccccc2c(=O)o1
: