Target
Plasminogen
Ligand
BDBM50063703
Substrate
Meas. Tech.
ChEBML_155056
IC50
6680±n/a nM
Citation
 Gilmore, JLHays, SJCaprathe, BWLee, CEmmerling, MRMichael, WJaen, JC Synthesis and evaluation of 2-aryl-4H-3,1-benzoxazin-4-ones as C1r serine protease inhibitors Bioorg Med Chem Lett 6:679-682 (1996)    Article 
Target
Name:
Plasminogen
Synonyms:
Activation peptide PLG Plasmin Plasmin heavy chain A, short form | Plasmin light chain B
Type:
Enzyme
Mol. Mass.:
90579.18
Organism:
Homo sapiens (Human)
Description:
Residue:
810
  
Inhibitor
Name:
BDBM50063703
Synonyms:
2-(2-Iodo-phenyl)-benzo[d][1,3]oxazin-4-one | CHEMBL10378
Type:
Small organic molecule
Emp. Form.:
C14H8INO2
Mol. Mass.:
349.1233
SMILES:
Ic1ccccc1-c1nc2ccccc2c(=O)o1
: