Target
Neutrophil elastase
Ligand
BDBM50015927
Substrate
Meas. Tech.
ChEBML_82429
IC50
1800±n/a nM
Citation
 Maiti, SNCzajkowski, DPReddy, NASpevak, PKaleta, JMicetich, RG Synthesis of 7α-methoxy-2-(1,3-dithiolan-2-ylidene)cephem sulphones. A new series of human leukocyte elastase inhibitors Bioorg Med Chem Lett 6:823-826 (1996)    Article 
Target
Name:
Neutrophil elastase
Synonyms:
Bone marrow serine protease Coagulation factor X ELANE Elastase HLE Leukocyte elastase Medullasin Neutrophil elastase (HNE) PMN elastase Trypsin
Type:
Enzyme
Mol. Mass.:
28532.38
Organism:
Homo sapiens (Human)
Description:
P08246
Residue:
267
  
Inhibitor
Name:
BDBM50015927
Synonyms:
(S)-7-Methoxy-3-methyl-5,5,8-trioxo-5lambda*6*-thia-1-aza-bicyclo[4.2.0]oct-2-ene-2-carboxylic acid tert-butyl ester CHEMBL309897
Type:
Small organic molecule
Emp. Form.:
C13H19NO6S
Mol. Mass.:
317.358
SMILES:
CO[C@@H]1C2N(C1=O)C(C(=O)OC(C)(C)C)=C(C)CS2(=O)=O
: