Target
Substance-P receptor
Ligand
BDBM50289186
Substrate
Meas. Tech.
ChEBML_142884
IC50
74±n/a nM
Citation
 Burkholder, TPKudlacz, EMLe, TBKnippenberg, RWShatzer, SAMaynard, GDWebster, MEHorgan, SW Identification and chemical synthesis of MDL 105,212, a non-peptide tachykinin antagonist with high affinity for NK1 and NK2 receptors Bioorg Med Chem Lett 6:951-956 (1996)    Article 
Target
Name:
Substance-P receptor
Synonyms:
NK-1 receptor NK1 Receptor NK1R_HUMAN Neurokinin-1 (NK-1) SPR TACR1 Tachykinin receptor 1 (NK1) | tachykinin
Type:
G Protein-Coupled Receptor (GPCR)
Mol. Mass.:
46254.43
Organism:
Homo sapiens (Human)
Description:
P25103
Residue:
407
  
Inhibitor
Name:
BDBM50289186
Synonyms:
1-{2-[3-(3,4-Dichloro-phenyl)-1-(2-methoxy-benzoyl)-pyrrolidin-3-yl]-ethyl}-4-phenyl-piperidine-4-carboxylic acid amide | CHEMBL176682
Type:
Small organic molecule
Emp. Form.:
C32H35Cl2N3O3
Mol. Mass.:
580.545
SMILES:
COc1ccccc1C(=O)N1CCC(CCN2CCC(CC2)(C(N)=O)c2ccccc2)(C1)c1ccc(Cl)c(Cl)c1
: