Target
Neprilysin
Ligand
BDBM50175518
Substrate
Meas. Tech.
ChEBML_144622
Ki
0.070000±n/a nM
Citation
 Warshawsky, AMFlynn, GAKoehl, JRMehdi, SVaz, RJ The synthesis of aminobenzazepinones as anti-phenylalanine dipeptide mimics and their use in nep inhibition Bioorg Med Chem Lett 6:957-962 (1996)    Article 
Target
Name:
Neprilysin
Synonyms:
Mme Neprilysin Neutral endopeptidase 24.11
Type:
Protein
Mol. Mass.:
85789.59
Organism:
Rattus norvegicus (Rat)
Description:
P07861
Residue:
750
  
Inhibitor
Name:
BDBM50175518
Synonyms:
(3R,7S)-7-((R)-2-Mercapto-3-phenyl-propionylamino)-6-oxo-1,2,3,4,6,7,8,12b-octahydro-benzo[c]pyrido[1,2-a]azepine-4-carboxylic acid | CHEMBL198316
Type:
Small organic molecule
Emp. Form.:
C24H26N2O4S
Mol. Mass.:
438.539
SMILES:
OC(=O)[C@H]1CCCC2N1C(=O)[C@H](Cc1ccccc21)NC(=O)[C@H](S)Cc1ccccc1
: