Target
Gastrin/cholecystokinin type B receptor
Ligand
BDBM50289202
Substrate
Meas. Tech.
ChEBML_48585
IC50
>10000±n/a nM
Citation
 González-Muñiz, RDomínguez, MsMartín-Martínez, MHerranz, RGarcía-López, MsBarber, ABallaz, SRío, JD CCK-4 restricted analogues containing a 3-oxoindolizidine skeleton Bioorg Med Chem Lett 6:967-972 (1996)    Article 
Target
Name:
Gastrin/cholecystokinin type B receptor
Synonyms:
Cckbr Cholecystokinin B receptor GASR_RAT | Gastrin/cholecystokinin type B receptor
Type:
Enzyme Catalytic Domain
Mol. Mass.:
48980.43
Organism:
RAT
Description:
Cholecystokinin A CCKBR RAT::P30553
Residue:
452
  
Inhibitor
Name:
BDBM50289202
Synonyms:
(2S,8S,8aR)-2-Benzyl-8-[(R)-2-tert-butoxycarbonylamino-3-(1H-indol-3-yl)-propionylamino]-3-oxo-octahydro-indolizine-2-carboxylic acid methyl ester | CHEMBL368152
Type:
Small organic molecule
Emp. Form.:
C33H40N4O6
Mol. Mass.:
588.6939
SMILES:
COC(=O)[C@@]1(Cc2ccccc2)C[C@@H]2[C@H](CCCN2C1=O)NC(=O)[C@@H](Cc1c[nH]c2ccccc12)NC(=O)OC(C)(C)C
: