Target
Alpha-1A/Alpha-1B/Alpha-1D adrenergic receptor
Ligand
BDBM50289292
Substrate
Meas. Tech.
ChEMBL_33249 (CHEMBL643529)
Ki
266±n/a nM
Citation
 Calligaro, DOFairhurst, JHotten, TMMoore, NATupper, DE The synthesis and biological activity of some known and putative metabolites of the atypical antipsychotic agent olanzapine (LY170053) Bioorg Med Chem Lett 7:25-30 (1997)    Article 
Target
Name:
Alpha-1A/Alpha-1B/Alpha-1D adrenergic receptor
Synonyms:
Adrenergic receptor alpha-1
Type:
Mol. Mass.:
Description:
ASSAY_ID of ChEMBL is 306566
Components:
This complex has 3 components.
Component 1
Name:
Alpha-1D adrenergic receptor
Synonyms:
ADA1D_HUMAN ADRA1D Adrenergic receptor alpha Alpha 1D-adrenoreceptor Alpha-1D adrenoceptor adrenergic Alpha1D
Type:
Enzyme Catalytic Domain
Mol. Mass.:
60485.82
Organism:
Homo sapiens (Human)
Description:
adrenergic Alpha1D ADRA1D HUMAN::P25100
Residue:
572
  
Component 2
Name:
Alpha-1B adrenergic receptor
Synonyms:
ADA1B_HUMAN Adrenergic alpha1B Adrenergic receptor alpha Alpha 1B-adrenoreceptor | Alpha-1B adrenergic receptor
Type:
Enzyme
Mol. Mass.:
56862.13
Organism:
Homo sapiens (Human)
Description:
P35368
Residue:
520
  
Component 3
Name:
Alpha-1A adrenergic receptor
Synonyms:
ADA1A_HUMAN ADRA1C Alpha 1A-adrenoceptor Alpha adrenergic receptor 1a Alpha-adrenergic receptor 1c adrenergic Alpha1 | adrenergic Alpha1C
Type:
Cell-surface receptors
Mol. Mass.:
51511.67
Organism:
Homo sapiens (Human)
Description:
P35348
Residue:
466
  
Inhibitor
Name:
BDBM50289292
Synonyms:
2-Methyl-10-(4-methyl-4-oxy-piperazin-1-yl)-4H-3-thia-4,9-diaza-benzo[f]azulene | CHEMBL440512
Type:
Small organic molecule
Emp. Form.:
C17H20N4OS
Mol. Mass.:
328.432
SMILES:
Cc1cc2c(Nc3ccccc3N=C2N2CC[N+](C)([O-])CC2)s1
: