Target
Caspase-1
Ligand
BDBM50289411
Substrate
Meas. Tech.
ChEBML_90985
Ki
21±n/a nM
Citation
 Semple, GAshworth, DMBaker, GRBatt, ARBaxter, AJBenzies, DWElliot, LHEvans, DFranklin, RJHudson, PJenkins, PDPitt, GRRooker, DPSheppard, ASzelke, MYamamoto, SIsomura, Y PYRIDONE-BASED PEPTIDOMIMETIC INHIBITORS OF INTERLEUKIN-1β-CONVERTING ENZYME (ICE) Bioorg Med Chem Lett 7:1337-1342 (1997)    Article 
Target
Name:
Caspase-1
Synonyms:
CASP1 Caspase ICE IL1BCE Interleukin-1 beta-converting enzyme
Type:
Enzyme
Mol. Mass.:
45154.13
Organism:
Homo sapiens (Human)
Description:
P29466
Residue:
404
  
Inhibitor
Name:
BDBM50289411
Synonyms:
(S)-3-(3-Methyl-2-{3-[(naphthalene-1-carbonyl)-amino]-2-oxo-2H-pyridin-1-yl}-butyrylamino)-4-oxo-5-phenoxy-pentanoic acid | CHEMBL27304
Type:
Small organic molecule
Emp. Form.:
C32H31N3O7
Mol. Mass.:
569.6044
SMILES:
CC(C)C(C(=O)N[C@@H](CC(O)=O)C(=O)COc1ccccc1)n1cccc(NC(=O)c2cccc3ccccc23)c1=O
: