Target
D(4) dopamine receptor
Ligand
BDBM50289457
Substrate
Meas. Tech.
ChEBML_58931
Ki
2±n/a nM
Citation
 Wright, JLGregory, TFHeffner, TGMacKenzie, RGPugsley, TAMeulen, SVWise, LD Discovery of selective dopamine D4 receptor antagonists: 1-Aryloxy-3-(4-aryloxypiperidinyl)-2-propanols Bioorg Med Chem Lett 7:1377-1380 (1997)    Article 
Target
Name:
D(4) dopamine receptor
Synonyms:
D(2C) dopamine receptor DOPAMINE D4.2 DRD4 Dopamine D4 receptor
Type:
Enzyme
Mol. Mass.:
48373.19
Organism:
Homo sapiens (Human)
Description:
P21917
Residue:
419
  
Inhibitor
Name:
BDBM50289457
Synonyms:
(R)-1-Phenoxy-3-(4-phenoxy-piperidin-1-yl)-propan-2-ol | CHEMBL31991
Type:
Small organic molecule
Emp. Form.:
C20H25NO3
Mol. Mass.:
327.4174
SMILES:
O[C@@H](COc1ccccc1)CN1CCC(CC1)Oc1ccccc1
: