Target
Prothrombin
Ligand
BDBM50076074
Substrate
Meas. Tech.
ChEBML_208130
IC50
0.505000±n/a nM
Citation
 Tamura, SYSemple, JEReiner, JEGoldman, EABrunck, TKLim-Wilby, MSCarpenter, SHRote, WEOldeshulte, GLRichard, BMNutt, RFRipka, WC Design and synthesis of a novel class of thrombin inhibitors incorporating heterocyclic dipeptide surrogates Bioorg Med Chem Lett 7:1543-1548 (1997)    Article 
Target
Name:
Prothrombin
Synonyms:
Activation peptide fragment 1 Coagulation factor II Prothrombin precursor Thrombin heavy chain | Thrombin light chain
Type:
Protein
Mol. Mass.:
70029.57
Organism:
Homo sapiens (Human)
Description:
P00734
Residue:
622
  
Inhibitor
Name:
BDBM50076074
Synonyms:
1N-[1-amino(imino)methyl-6-hydroxy-(5S)-tetrahydro-5-pyridinyl]-2-(3-benzylsulfonamido-2-oxo-1,2-dihydro-1-pyridinyl)acetamide N-((S)-1-Carbamimidoyl-2-hydroxy-piperidin-3-yl)-2-(2-oxo-3-phenylmethanesulfonylamino-2H-pyridin-1-yl)-acetamide
Type:
Small organic molecule
Emp. Form.:
C20H26N6O5S
Mol. Mass.:
462.523
SMILES:
NC(=N)N1CCC[C@H](NC(=O)Cn2cccc(NS(=O)(=O)Cc3ccccc3)c2=O)C1O
: