Target
Nitric oxide synthase, inducible
Ligand
BDBM50289677
Substrate
Meas. Tech.
ChEBML_89335
Ki
1900±n/a nM
Citation
 Shearer, BGLee, SFranzmann, KWWhite, HASanders, DCKiff, RJGarvey, EPFurfine, ES Conformationally restricted arginine analogues as inhibitors of human nitric oxide synthase Bioorg Med Chem Lett 7:1763-1768 (1997)    Article 
Target
Name:
Nitric oxide synthase, inducible
Synonyms:
HEP-NOS Inducible NO synthase NOS type II NOS2A Nitric oxide synthase, inducible (iNOS) | iNOS
Type:
Homodimer
Mol. Mass.:
131141.95
Organism:
Homo sapiens (Human)
Description:
P35228
Residue:
1153
  
Inhibitor
Name:
BDBM50289677
Synonyms:
3-(2-Acetimidoylamino-phenyl)-2-amino-propionic acid | CHEMBL52280
Type:
Small organic molecule
Emp. Form.:
C11H15N3O2
Mol. Mass.:
221.2557
SMILES:
CC(N)=Nc1ccccc1CC(N)C(O)=O
: