Target
Proto-oncogene tyrosine-protein kinase Src
Ligand
BDBM50289750
Substrate
Meas. Tech.
ChEMBL_154591 (CHEMBL762577)
IC50
30000±n/a nM
Citation
 Stankovic, CJSurendran, NLunney, EAPlummer, MSPara, KSShahripour, AFergus, JHMarks, JSHerrera, RHubbell, SEHumblet, CSaltiel, ARStewart, BHSawyer, TK The Role of 4-phosphonodifluoromethyl- and 4-phosphono-phenylalanine in the selectivity and cellular uptake of SH2 domain ligands Bioorg Med Chem Lett 7:1909-1914 (1997)    Article 
Target
Name:
Proto-oncogene tyrosine-protein kinase Src
Synonyms:
Calmodulin/Proto-oncogene tyrosine-protein kinase Src Proto-oncogene c-Src SRC SRC_HUMAN V-src sarcoma (Schmidt-Ruppin A-2) viral oncogene homolog (avian) p60-Src | pp60c-src
Type:
Protein
Mol. Mass.:
59838.60
Organism:
Homo sapiens (Human)
Description:
P12931
Residue:
536
  
Inhibitor
Name:
BDBM50289750
Synonyms:
(S)-4-{(S)-2-Acetylamino-3-[4-(difluoro-phosphono-methyl)-phenyl]-propionylamino}-4-[(3-cyclohexyl-propyl)-methyl-carbamoyl]-butyric acid | CHEMBL58478
Type:
Small organic molecule
Emp. Form.:
C27H40F2N3O8P
Mol. Mass.:
603.5924
SMILES:
CN(CCCC1CCCCC1)C(=O)[C@H](CCC(O)=O)NC(=O)[C@H](Cc1ccc(cc1)C(F)(F)P(O)(O)=O)NC(C)=O
: